Target
D(2) dopamine receptor
Ligand
BDBM50036855
Substrate
Meas. Tech.
ChEMBL_59314 (CHEMBL670208)
IC50
3±n/a nM
Citation
 Podona, TGuardiola-Lemaître, BCaignard, DHAdam, GPfeiffer, BRenard, PGuillaumet, G 3,4-Dihydro-3-amino-2H-1-benzopyran derivatives as 5-HT1A receptor ligands and potential anxiolytic agents. 1. Synthesis and structure--activity relationship studies. J Med Chem 37:1779-93 (1994)  
Target
Name:
D(2) dopamine receptor
Synonyms:
DOPAMINE D2 DRD2_BOVIN | Dopamine D2 receptor
Type:
Enzyme Catalytic Domain
Mol. Mass.:
50698.79
Organism:
BOVINE
Description:
P20288
Residue:
444
  
Inhibitor
Name:
BDBM50036855
Synonyms:
2-{4-[(5-Methoxy-chroman-3-yl)-propyl-amino]-butyl}-hexahydro-cyclopenta[c]pyrrol-1-one; compound with oxalic acid | CHEMBL299561
Type:
Small organic molecule
Emp. Form.:
C24H36N2O3
Mol. Mass.:
400.5542
SMILES:
CCCN(CCCCN1CC2CCCC2C1=O)C1COc2cccc(OC)c2C1
: