Target
D(2) dopamine receptor
Ligand
BDBM50036858
Substrate
Meas. Tech.
ChEMBL_59314 (CHEMBL670208)
IC50
30±n/a nM
Citation
 Podona, TGuardiola-Lemaître, BCaignard, DHAdam, GPfeiffer, BRenard, PGuillaumet, G 3,4-Dihydro-3-amino-2H-1-benzopyran derivatives as 5-HT1A receptor ligands and potential anxiolytic agents. 1. Synthesis and structure--activity relationship studies. J Med Chem 37:1779-93 (1994)  
Target
Name:
D(2) dopamine receptor
Synonyms:
DOPAMINE D2 DRD2_BOVIN | Dopamine D2 receptor
Type:
Enzyme Catalytic Domain
Mol. Mass.:
50698.79
Organism:
BOVINE
Description:
P20288
Residue:
444
  
Inhibitor
Name:
BDBM50036858
Synonyms:
(5-Methoxy-chroman-3-yl)-(4-morpholin-4-yl-butyl)-propyl-amine | CHEMBL284912
Type:
Small organic molecule
Emp. Form.:
C21H34N2O3
Mol. Mass.:
362.5063
SMILES:
CCCN(CCCCN1CCOCC1)C1COc2cccc(OC)c2C1
: