Target
3-oxo-5-alpha-steroid 4-dehydrogenase 1
Ligand
BDBM50039312
Substrate
Meas. Tech.
ChEMBL_205220 (CHEMBL816494)
Ki
6.2±n/a nM
Citation
 Frye, SVHaffner, CDMaloney, PRMook, RADorsey, GFHiner, RNCribbs, CMWheeler, TNRay, JAAndrews, RC 6-Azasteroids: structure-activity relationships for inhibition of type 1 and 2 human 5 alpha-reductase and human adrenal 3 beta-hydroxy-delta 5-steroid dehydrogenase/3-keto-delta 5-steroid isomerase. J Med Chem 37:2352-60 (1994)  
Target
Name:
3-oxo-5-alpha-steroid 4-dehydrogenase 1
Synonyms:
3-oxo-5-alpha-steroid 4-dehydrogenase 1 S5A1_HUMAN SR type 1 Steroid 5-alpha-reductase | Steroid 5-alpha-reductase 1
Type:
Enzyme
Mol. Mass.:
29472.80
Organism:
Homo sapiens (Human)
Description:
P18405
Residue:
259
  
Inhibitor
Name:
BDBM50039312
Synonyms:
(1S,9aR,11aS)-5,6,9a,11a-Tetramethyl-7-oxo-2,3,3a,3b,4,5,7,8,9,9a,9b,10,11,11a-tetradecahydro-1H-cyclopenta[i]phenanthridine-1-carboxylic acid adamantan-1-ylamide | CHEMBL307398
Type:
Small organic molecule
Emp. Form.:
C31H46N2O2
Mol. Mass.:
478.7091
SMILES:
CN1CC2C3CC[C@H](C(=O)NC45CC6CC(CC(C6)C4)C5)[C@@]3(C)CCC2[C@@]2(C)CCC(=O)C(C)=C12
: