Target
Carnitine O-acetyltransferase
Ligand
BDBM50037264
Substrate
Meas. Tech.
ChEMBL_46180 (CHEMBL660926)
Ki
1900000±n/a nM
Citation
 Saeed, AMcMillin, JBWolkowicz, PEBrouillette, WJ 3-Amino-5,5-dimethylhexanoic acid. Synthesis, resolution, and effects on carnitine acyltransferases. J Med Chem 37:3247-51 (1994)  
Target
Name:
Carnitine O-acetyltransferase
Synonyms:
CACP_HUMAN CAT1 Carnitine O-acetyltransferase Carnitine acetyltransferase
Type:
PROTEIN
Mol. Mass.:
70873.46
Organism:
Homo sapiens (Human)
Description:
ChEMBL_46180
Residue:
626
  
Inhibitor
Name:
BDBM50037264
Synonyms:
(S)-3-Amino-5,5-dimethyl-hexanoic acid anion
Type:
Small organic molecule
Emp. Form.:
C8H16NO2
Mol. Mass.:
158.2187
SMILES:
CC(C)(C)C[C@H](N)CC([O-])=O
: