Target
Beta-galactosidase
Ligand
BDBM50403869
Substrate
Meas. Tech.
ChEMBL_37276 (CHEMBL656026)
IC50
580000±n/a nM
Citation
 Asano, NOseki, KKizu, HMatsui, K Nitrogen-in-the-ring pyranoses and furanoses: structural basis of inhibition of mammalian glycosidases. J Med Chem 37:3701-6 (1994)  
Target
Name:
Beta-galactosidase
Synonyms:
β-galactosidase Beta-galactosidase/Glucosylceramidase | GLB1
Type:
Protein
Mol. Mass.:
73420.88
Organism:
Bos taurus (Bovine)
Description:
Residue:
653
  
Inhibitor
Name:
BDBM50403869
Synonyms:
CHEMBL2115197
Type:
Small organic molecule
Emp. Form.:
C6H13NO2
Mol. Mass.:
131.1729
SMILES:
CC[C@H]1NC[C@H](O)[C@@H]1O
: