Target
Lysosomal alpha-glucosidase
Ligand
BDBM50403869
Substrate
Meas. Tech.
ChEMBL_34414 (CHEMBL649418)
IC50
610000±n/a nM
Citation
 Asano, NOseki, KKizu, HMatsui, K Nitrogen-in-the-ring pyranoses and furanoses: structural basis of inhibition of mammalian glycosidases. J Med Chem 37:3701-6 (1994)  
Target
Name:
Lysosomal alpha-glucosidase
Synonyms:
Acidic alpha-glucosidase LYAG_RAT
Type:
PROTEIN
Mol. Mass.:
106191.24
Organism:
Rattus norvegicus
Description:
ChEMBL_1506157
Residue:
953
  
Inhibitor
Name:
BDBM50403869
Synonyms:
CHEMBL2115197
Type:
Small organic molecule
Emp. Form.:
C6H13NO2
Mol. Mass.:
131.1729
SMILES:
CC[C@H]1NC[C@H](O)[C@@H]1O
: