Target
Lysosomal alpha-glucosidase
Ligand
BDBM50403869
Substrate
Meas. Tech.
ChEMBL_34402 (CHEMBL649272)
IC50
540000±n/a nM
Citation
 Asano, NOseki, KKizu, HMatsui, K Nitrogen-in-the-ring pyranoses and furanoses: structural basis of inhibition of mammalian glycosidases. J Med Chem 37:3701-6 (1994)  
Target
Name:
Lysosomal alpha-glucosidase
Synonyms:
Alpha-glucosidase LYAG_BOVIN
Type:
PROTEIN
Mol. Mass.:
104738.88
Organism:
Bos taurus
Description:
ChEMBL_215887
Residue:
937
  
Inhibitor
Name:
BDBM50403869
Synonyms:
CHEMBL2115197
Type:
Small organic molecule
Emp. Form.:
C6H13NO2
Mol. Mass.:
131.1729
SMILES:
CC[C@H]1NC[C@H](O)[C@@H]1O
: