Target
Gastrin/cholecystokinin type B receptor
Ligand
BDBM50026690
Substrate
Meas. Tech.
ChEMBL_71528 (CHEMBL679994)
Kd
1.4±n/a nM
Citation
 Schmidt, BFHernandez, LRouzer, CCzerwinski, GChmurny, GMichejda, CJ Peptide-linked 1,3-dialkyl-3-acyltriazenes: gastrin receptor directed antineoplastic alkylating agents. J Med Chem 37:3812-8 (1994)  
Target
Name:
Gastrin/cholecystokinin type B receptor
Synonyms:
Cckbr Cholecystokinin B receptor GASR_RAT | Gastrin/cholecystokinin type B receptor
Type:
Enzyme Catalytic Domain
Mol. Mass.:
48980.43
Organism:
RAT
Description:
Cholecystokinin A CCKBR RAT::P30553
Residue:
452
  
Inhibitor
Name:
BDBM50026690
Synonyms:
2-[2-(2-{2-[2-{2-[2-(2-Amino-3-phenyl-propionylamino)-3-carboxy-propionylamino]-4-methylsulfanyl-butyrylamino}-3-(1H-indol-3-yl)-propionylamino]-acetylamino}-4-methylsulfanyl-butyrylamino)-3-(4-sulfo-phenyl)-propionylamino]-succinic acid(gastrin)(Glu-Gly-Pro-Trp-Leu-Glu-Glu-Glu-Glu-Glu-Ala-Tyr-Gly-Trp-Met-Asp-Phe-NH2) | CHEMBL413654
Type:
Small organic molecule
Emp. Form.:
C97H126N20O32S
Mol. Mass.:
2116.218
SMILES:
CSCC[C@@H](NC(=O)[C@@H](Cc1c[nH]c2ccccc12)NC(=O)CNC(=O)[C@@H](Cc1ccc(O)cc1)NC(=O)[C@@H](C)NC(=O)[C@@H](CCC(O)=O)NC(=O)[C@@H](CCC(O)=O)NC(=O)[C@@H](CCC(O)=O)NC(=O)[C@H](CCC(O)=O)NC(=O)[C@H](CCC(O)=O)NC(=O)[C@H](CC(C)C)NC(=O)[C@H](Cc1c[nH]c2ccccc12)NC(=O)[C@@H]1CCCN1C(=O)CNC(=O)[C@@H](N)CCC(O)=O)C(=O)N[C@H](CC(O)=O)C(=O)N[C@H](Cc1ccccc1)C(N)=O
: