Target
Serine protease 1
Ligand
BDBM50037993
Substrate
Meas. Tech.
ChEMBL_212378 (CHEMBL878759)
Ki
7500±n/a nM
Citation
 Hilpert, KAckermann, JBanner, DWGast, AGubernator, KHadváry, PLabler, LMüller, KSchmid, GTschopp, TB Design and synthesis of potent and highly selective thrombin inhibitors. J Med Chem 37:3889-901 (1994)  
Target
Name:
Serine protease 1
Synonyms:
Beta-Trypsin PRSS1 TRY1 TRYP1 Trypsin I
Type:
Enzyme
Mol. Mass.:
25790.52
Organism:
Bos taurus (bovine)
Description:
P00760
Residue:
246
  
Inhibitor
Name:
BDBM50037993
Synonyms:
(S)-N-(1-Carbamimidoyl-piperidin-3-ylmethyl)-4-morpholin-4-yl-3-(naphthalene-2-sulfonylamino)-4-oxo-butyramide; hydrochloride | CHEMBL558215
Type:
Small organic molecule
Emp. Form.:
C25H34N6O5S
Mol. Mass.:
530.64
SMILES:
NC(=N)N1CCCC(CNC(=O)C[C@H](NS(=O)(=O)c2ccc3ccccc3c2)C(=O)N2CCOCC2)C1
: