Target
Serine protease 1
Ligand
BDBM50037985
Substrate
Meas. Tech.
ChEMBL_212378 (CHEMBL878759)
Ki
27000±n/a nM
Citation
 Hilpert, KAckermann, JBanner, DWGast, AGubernator, KHadváry, PLabler, LMüller, KSchmid, GTschopp, TB Design and synthesis of potent and highly selective thrombin inhibitors. J Med Chem 37:3889-901 (1994)  
Target
Name:
Serine protease 1
Synonyms:
Beta-Trypsin PRSS1 TRY1 TRYP1 Trypsin I
Type:
Enzyme
Mol. Mass.:
25790.52
Organism:
Bos taurus (bovine)
Description:
P00760
Residue:
246
  
Inhibitor
Name:
BDBM50037985
Synonyms:
CHEMBL553963 | {[(S)-3-[((S)-1-Carbamimidoyl-piperidin-3-ylmethyl)-carbamoyl]-2-(naphthalene-2-sulfonylamino)-propionyl]-cyclohexyl-amino}-acetic acid ethyl ester; hydrochloride
Type:
Small organic molecule
Emp. Form.:
C31H44N6O6S
Mol. Mass.:
628.783
SMILES:
CCOC(=O)CN(C1CCCCC1)C(=O)[C@H](CC(=O)NC[C@@H]1CCCN(C1)C(N)=N)NS(=O)(=O)c1ccc2ccccc2c1
: