Target
Serine protease 1
Ligand
BDBM50037983
Substrate
Meas. Tech.
ChEMBL_212378 (CHEMBL878759)
Ki
1100±n/a nM
Citation
 Hilpert, KAckermann, JBanner, DWGast, AGubernator, KHadváry, PLabler, LMüller, KSchmid, GTschopp, TB Design and synthesis of potent and highly selective thrombin inhibitors. J Med Chem 37:3889-901 (1994)  
Target
Name:
Serine protease 1
Synonyms:
Beta-Trypsin PRSS1 TRY1 TRYP1 Trypsin I
Type:
Enzyme
Mol. Mass.:
25790.52
Organism:
Bos taurus (bovine)
Description:
P00760
Residue:
246
  
Inhibitor
Name:
BDBM50037983
Synonyms:
(2R,4R)-1-[(S)-3-[((S)-1-Carbamimidoyl-piperidin-3-ylmethyl)-carbamoyl]-2-(naphthalene-2-sulfonylamino)-propionyl]-4-methyl-piperidine-2-carboxylic acid ethyl ester; compound with acetic acid | CHEMBL409333
Type:
Small organic molecule
Emp. Form.:
C30H42N6O6S
Mol. Mass.:
614.756
SMILES:
CCOC(=O)[C@H]1C[C@H](C)CCN1C(=O)[C@H](CC(=O)NC[C@@H]1CCCN(C1)C(N)=N)NS(=O)(=O)c1ccc2ccccc2c1
: