Target
Prothrombin
Ligand
BDBM50037981
Substrate
Meas. Tech.
ChEMBL_208319 (CHEMBL812837)
Ki
150±n/a nM
Citation
 Hilpert, KAckermann, JBanner, DWGast, AGubernator, KHadváry, PLabler, LMüller, KSchmid, GTschopp, TB Design and synthesis of potent and highly selective thrombin inhibitors. J Med Chem 37:3889-901 (1994)  
Target
Name:
Prothrombin
Synonyms:
Activation peptide fragment 1 Coagulation factor II Prothrombin precursor Thrombin heavy chain | Thrombin light chain
Type:
Protein
Mol. Mass.:
70029.57
Organism:
Homo sapiens (Human)
Description:
P00734
Residue:
622
  
Inhibitor
Name:
BDBM50037981
Synonyms:
CHEMBL103102 Piperidine-1-carboxamidine; compound with GENERIC INORGANIC NEUTRAL COMPONENT
Type:
Small organic molecule
Emp. Form.:
C6H13N3
Mol. Mass.:
127.1875
SMILES:
NC(=N)N1CCCCC1
: