Target
Prothrombin
Ligand
BDBM50037993
Substrate
Meas. Tech.
ChEMBL_208319 (CHEMBL812837)
Ki
19±n/a nM
Citation
 Hilpert, KAckermann, JBanner, DWGast, AGubernator, KHadváry, PLabler, LMüller, KSchmid, GTschopp, TB Design and synthesis of potent and highly selective thrombin inhibitors. J Med Chem 37:3889-901 (1994)  
Target
Name:
Prothrombin
Synonyms:
Activation peptide fragment 1 Coagulation factor II Prothrombin precursor Thrombin heavy chain | Thrombin light chain
Type:
Protein
Mol. Mass.:
70029.57
Organism:
Homo sapiens (Human)
Description:
P00734
Residue:
622
  
Inhibitor
Name:
BDBM50037993
Synonyms:
(S)-N-(1-Carbamimidoyl-piperidin-3-ylmethyl)-4-morpholin-4-yl-3-(naphthalene-2-sulfonylamino)-4-oxo-butyramide; hydrochloride | CHEMBL558215
Type:
Small organic molecule
Emp. Form.:
C25H34N6O5S
Mol. Mass.:
530.64
SMILES:
NC(=N)N1CCCC(CNC(=O)C[C@H](NS(=O)(=O)c2ccc3ccccc3c2)C(=O)N2CCOCC2)C1
: