Target
Prothrombin
Ligand
BDBM50037999
Substrate
Meas. Tech.
ChEMBL_208319 (CHEMBL812837)
Ki
660±n/a nM
Citation
 Hilpert, KAckermann, JBanner, DWGast, AGubernator, KHadváry, PLabler, LMüller, KSchmid, GTschopp, TB Design and synthesis of potent and highly selective thrombin inhibitors. J Med Chem 37:3889-901 (1994)  
Target
Name:
Prothrombin
Synonyms:
Activation peptide fragment 1 Coagulation factor II Prothrombin precursor Thrombin heavy chain | Thrombin light chain
Type:
Protein
Mol. Mass.:
70029.57
Organism:
Homo sapiens (Human)
Description:
P00734
Residue:
622
  
Inhibitor
Name:
BDBM50037999
Synonyms:
(S)-N-(1-Carbamimidoyl-piperidin-3-ylmethyl)-3-(1H-indol-3-yl)-2-(naphthalene-2-sulfonylamino)-propionamide; hydrochloride | CHEMBL542951
Type:
Small organic molecule
Emp. Form.:
C28H32N6O3S
Mol. Mass.:
532.657
SMILES:
NC(=N)N1CCCC(CNC(=O)[C@H](Cc2c[nH]c3ccccc23)NS(=O)(=O)c2ccc3ccccc3c2)C1
: