Target
Aminopeptidase N
Ligand
BDBM50036817
Substrate
Meas. Tech.
ChEMBL_35506 (CHEMBL646416)
Ki
17000±n/a nM
Citation
 Chauvel, ENCoric, PLlorens-Cortès, CWilk, SRoques, BPFournié-Zaluski, MC Investigation of the active site of aminopeptidase A using a series of new thiol-containing inhibitors. J Med Chem 37:1339-46 (1994)  
Target
Name:
Aminopeptidase N
Synonyms:
AMPN_HUMAN APN Aminopeptidase CD_antigen=CD13 Myeloid plasma membrane glycoprotein CD13 gp150 | hAPN
Type:
PROTEIN
Mol. Mass.:
109522.63
Organism:
Homo sapiens (Human)
Description:
ChEMBL_1507526
Residue:
967
  
Inhibitor
Name:
BDBM50036817
Synonyms:
(R)-4-Amino-5-mercapto-pentanoic acid | CHEMBL27656
Type:
Small organic molecule
Emp. Form.:
C5H11NO2S
Mol. Mass.:
149.211
SMILES:
N[C@@H](CS)CCC(O)=O
: