Target
Glutamyl aminopeptidase
Ligand
BDBM50036825
Substrate
Meas. Tech.
ChEMBL_32828 (CHEMBL646206)
Ki
2400±n/a nM
Citation
 Chauvel, ENCoric, PLlorens-Cortès, CWilk, SRoques, BPFournié-Zaluski, MC Investigation of the active site of aminopeptidase A using a series of new thiol-containing inhibitors. J Med Chem 37:1339-46 (1994)  
Target
Name:
Glutamyl aminopeptidase
Synonyms:
AMPE_HUMAN Aminopeptidase A Differentiation antigen gp160 ENPEP | Glutamyl aminopeptidase
Type:
PROTEIN
Mol. Mass.:
109226.47
Organism:
Homo sapiens (Human)
Description:
ChEMBL_32829
Residue:
957
  
Inhibitor
Name:
BDBM50036825
Synonyms:
1-(3-Carboxy-phenyl)-2-mercapto-ethyl-ammonium CHEMBL281321
Type:
Small organic molecule
Emp. Form.:
C9H11NO2S
Mol. Mass.:
197.254
SMILES:
NC(CS)c1cccc(c1)C(O)=O
: