Target
Glutamyl aminopeptidase
Ligand
BDBM50036827
Substrate
Meas. Tech.
ChEMBL_32828 (CHEMBL646206)
Ki
2800±n/a nM
Citation
 Chauvel, ENCoric, PLlorens-Cortès, CWilk, SRoques, BPFournié-Zaluski, MC Investigation of the active site of aminopeptidase A using a series of new thiol-containing inhibitors. J Med Chem 37:1339-46 (1994)  
Target
Name:
Glutamyl aminopeptidase
Synonyms:
AMPE_HUMAN Aminopeptidase A Differentiation antigen gp160 ENPEP | Glutamyl aminopeptidase
Type:
PROTEIN
Mol. Mass.:
109226.47
Organism:
Homo sapiens (Human)
Description:
ChEMBL_32829
Residue:
957
  
Inhibitor
Name:
BDBM50036827
Synonyms:
CHEMBL27040 | [4-(2-Amino-3-mercapto-propyl)-cyclohexyl]-acetic acid
Type:
Small organic molecule
Emp. Form.:
C11H21NO2S
Mol. Mass.:
231.355
SMILES:
NC(CS)CC1CCC(CC(O)=O)CC1
: