Target
Voltage-dependent L-type calcium channel subunit alpha-1C
Ligand
BDBM50035802
Substrate
Meas. Tech.
ChEMBL_53172 (CHEMBL666481)
Kd
2700±n/a nM
Citation
 Rovnyak, GCKimball, SDBeyer, BCucinotta, GDiMarco, JDGougoutas, JHedberg, AMalley, MMcCarthy, JPZhang, R Calcium entry blockers and activators: conformational and structural determinants of dihydropyrimidine calcium channel modulators. J Med Chem 38:119-29 (1995)  
Target
Name:
Voltage-dependent L-type calcium channel subunit alpha-1C
Synonyms:
CAC1C_HUMAN CACN2 CACNL1A1 Calcium channel (Type L) L-type calcium channel alpha-1c/beta-2/alpha2delta-1 Voltage-gated L-type calcium channel Voltage-gated calcium channel | Voltage-gated calcium channel subunit alpha Cav1.2
Type:
Enzyme Catalytic Domain
Mol. Mass.:
248979.79
Organism:
Homo sapiens (Human)
Description:
Calcium channel (Type L) 0 HUMAN::Q13936
Residue:
2221
  
Inhibitor
Name:
BDBM50035802
Synonyms:
6-Methyl-2-methylsulfanyl-4-(2-methylsulfanyl-5-nitro-phenyl)-1,4-dihydro-pyrimidine-5-carboxylic acid methyl ester | CHEMBL23451
Type:
Small organic molecule
Emp. Form.:
C15H17N3O4S2
Mol. Mass.:
367.443
SMILES:
COC(=O)C1C(N=C(SC)N=C1C)c1cc(ccc1SC)[N+]([O-])=O
: