Target
Thermolysin
Ligand
BDBM50035246
Substrate
Meas. Tech.
ChEMBL_210393 (CHEMBL814123)
IC50
5±n/a nM
Citation
 Bihovsky, RLevinson, BLLoewi, RCErhardt, PWPolokoff, MA Hydroxamic acids as potent inhibitors of endothelin-converting enzyme from human bronchiolar smooth muscle. J Med Chem 38:2119-29 (1995)  
Target
Name:
Thermolysin
Synonyms:
THER_BACTH | npr
Type:
PROTEIN
Mol. Mass.:
60097.54
Organism:
Bacillus thermoproteolyticus
Description:
ChEMBL_1468794
Residue:
548
  
Inhibitor
Name:
BDBM50035246
Synonyms:
2-(2-Hydroxycarbamoyl-4-methyl-pentanoylamino)-3-(1H-indol-3-yl)-propionic acid | CHEMBL303159
Type:
Small organic molecule
Emp. Form.:
C18H23N3O5
Mol. Mass.:
361.3923
SMILES:
CC(C)CC(C(=O)NO)C(=O)NC(Cc1c[nH]c2ccccc12)C(O)=O
: