Target
Thermolysin
Ligand
BDBM50035249
Substrate
Meas. Tech.
ChEMBL_210393 (CHEMBL814123)
IC50
2±n/a nM
Citation
 Bihovsky, RLevinson, BLLoewi, RCErhardt, PWPolokoff, MA Hydroxamic acids as potent inhibitors of endothelin-converting enzyme from human bronchiolar smooth muscle. J Med Chem 38:2119-29 (1995)  
Target
Name:
Thermolysin
Synonyms:
THER_BACTH | npr
Type:
PROTEIN
Mol. Mass.:
60097.54
Organism:
Bacillus thermoproteolyticus
Description:
ChEMBL_1468794
Residue:
548
  
Inhibitor
Name:
BDBM50035249
Synonyms:
CHEMBL303892 | N-[1-Carbamoyl-2-(1H-indol-3-yl)-ethyl]-N'-hydroxy-2-isobutyl-malonamide
Type:
Small organic molecule
Emp. Form.:
C18H24N4O4
Mol. Mass.:
360.4076
SMILES:
CC(C)CC(C(=O)NO)C(=O)NC(Cc1c[nH]c2ccccc12)C(N)=O
: