Target
Alpha-2C adrenergic receptor
Ligand
BDBM50030623
Substrate
Meas. Tech.
ChEMBL_33532 (CHEMBL648623)
Ki
64±n/a nM
Citation
 Ruffolo, RRBondinell, WHieble, JP Alpha- and beta-adrenoceptors: from the gene to the clinic. 2. Structure-activity relationships and therapeutic applications. J Med Chem 38:3681-716 (1995)  
Target
Name:
Alpha-2C adrenergic receptor
Synonyms:
ADA2C_HUMAN ADRA2L2 Adrenergic alpha2C Adrenergic receptor alpha Alpha-2 adrenergic receptor subtype C4 Alpha-2C adrenoreceptor | adrenergic, alpha-2C-, receptor [Homo sapiens]
Type:
Enzyme
Mol. Mass.:
49552.32
Organism:
Homo sapiens (Human)
Description:
P18825
Residue:
462
  
Inhibitor
Name:
BDBM50030623
Synonyms:
6-Chloro-3-methyl-9-(3-methyl-but-2-enyloxy)-2,3,4,5-tetrahydro-1H-benzo[d]azepine SK&F-104078 SKF 104078
Type:
Small organic molecule
Emp. Form.:
C16H22ClNO
Mol. Mass.:
279.805
SMILES:
[#6]-[#7]-1-[#6]-[#6]-c2c(Cl)ccc(-[#8]-[#6]\[#6]=[#6](\[#6])-[#6])c2-[#6]-[#6]-1
: