Target
Muscarinic acetylcholine receptor M2
Ligand
BDBM50366775
Substrate
Meas. Tech.
ChEMBL_140181 (CHEMBL744098)
Ki
2.6±n/a nM
Citation
 Newman, AHKline, RHAllen, ACIzenwasser, SGeorge, CKatz, JL Novel 4'-substituted and 4',4"-disubstituted 3 alpha-(diphenylmethoxy)tropane analogs as potent and selective dopamine uptake inhibitors. J Med Chem 38:3933-40 (1995)  
Target
Name:
Muscarinic acetylcholine receptor M2
Synonyms:
ACM2_RAT Chrm-2 | Chrm2
Type:
Enzyme Catalytic Domain
Mol. Mass.:
51555.53
Organism:
RAT
Description:
P10980
Residue:
466
  
Inhibitor
Name:
BDBM50366775
Synonyms:
BENZTROPINE | Benzatropine
Type:
Small organic molecule
Emp. Form.:
C21H25NO
Mol. Mass.:
307.4293
SMILES:
CN1[C@H]2CC[C@@H]1C[C@@H](C2)OC(c1ccccc1)c1ccccc1
: