Target
Adenosine deaminase
Ligand
BDBM50407530
Substrate
Meas. Tech.
ChEMBL_30794 (CHEMBL645070)
Ki
30000±n/a nM
Citation
 Cristalli, GVittori, SEleuteri, AVolpini, RCamaioni, ELupidi, GMahmood, NBevilacqua, FPalù, G Synthesis and biological evaluation of N6-cycloalkyl derivatives of 1-deazaadenine nucleosides: a new class of anti-human immunodeficiency virus agents. J Med Chem 38:4019-25 (1995)  
Target
Name:
Adenosine deaminase
Synonyms:
ADA Adenosine aminohydrolase
Type:
Enzyme
Mol. Mass.:
40910.44
Organism:
Bos taurus (bovine)
Description:
Residue:
363
  
Inhibitor
Name:
BDBM50407530
Synonyms:
CHEMBL2113392
Type:
Small organic molecule
Emp. Form.:
C11H13ClN4O4
Mol. Mass.:
300.698
SMILES:
Nc1cc(Cl)nc2n(cnc12)[C@@H]1O[C@H](CO)[C@@H](O)[C@H]1O
: