Target
Adenosine receptor A1
Ligand
BDBM50407530
Substrate
Meas. Tech.
ChEMBL_29014 (CHEMBL875796)
Ki
226±n/a nM
Citation
 Siddiqi, SMJacobson, KAEsker, JLOlah, MEJi, XDMelman, NTiwari, KNSecrist, JASchneller, SWCristalli, G Search for new purine- and ribose-modified adenosine analogues as selective agonists and antagonists at adenosine receptors. J Med Chem 38:1174-88 (1995)  
Target
Name:
Adenosine receptor A1
Synonyms:
AA1R_RAT ADENOSINE A1 high Adenosine A1 receptor (A1) Adenosine receptors A1 | Adora1
Type:
Protein
Mol. Mass.:
36704.13
Organism:
Rattus norvegicus (rat)
Description:
Residue:
326
  
Inhibitor
Name:
BDBM50407530
Synonyms:
CHEMBL2113392
Type:
Small organic molecule
Emp. Form.:
C11H13ClN4O4
Mol. Mass.:
300.698
SMILES:
Nc1cc(Cl)nc2n(cnc12)[C@@H]1O[C@H](CO)[C@@H](O)[C@H]1O
: