Target
Adenosine receptor A1
Ligand
BDBM50454082
Substrate
Meas. Tech.
ChEMBL_29014 (CHEMBL875796)
Ki
62400±n/a nM
Citation
 Siddiqi, SMJacobson, KAEsker, JLOlah, MEJi, XDMelman, NTiwari, KNSecrist, JASchneller, SWCristalli, G Search for new purine- and ribose-modified adenosine analogues as selective agonists and antagonists at adenosine receptors. J Med Chem 38:1174-88 (1995)  
Target
Name:
Adenosine receptor A1
Synonyms:
AA1R_RAT ADENOSINE A1 high Adenosine A1 receptor (A1) Adenosine receptors A1 | Adora1
Type:
Protein
Mol. Mass.:
36704.13
Organism:
Rattus norvegicus (rat)
Description:
Residue:
326
  
Inhibitor
Name:
BDBM50454082
Synonyms:
CHEMBL2113395
Type:
Small organic molecule
Emp. Form.:
C19H22N6O4
Mol. Mass.:
398.4158
SMILES:
CNC(=O)[C@@]1(C)O[C@H]([C@H](O)[C@@H]1O)n1cnc2c(NCc3ccccc3)ncnc12
: