Target
Adenosine receptor A2a
Ligand
BDBM50369097
Substrate
Meas. Tech.
ChEMBL_30919 (CHEMBL647729)
Ki
1.6±n/a nM
Citation
 Cristalli, GCamaioni, EVittori, SVolpini, RBorea, PAConti, ADionisotti, SOngini, EMonopoli, A 2-Aralkynyl and 2-heteroalkynyl derivatives of adenosine-5'-N-ethyluronamide as selective A2a adenosine receptor agonists. J Med Chem 38:1462-72 (1995)  
Target
Name:
Adenosine receptor A2a
Synonyms:
AA2AR_RAT Adenosine A2 receptor Adenosine Receptors A2a (A2a) Adenosine receptors A2a Rat striatal adenosine A2a receptor
Type:
G Protein-Coupled Receptor (GPCR)
Mol. Mass.:
45015.65
Organism:
Rattus norvegicus (rat)
Description:
Rat A2A receptors expressed in CHO cells.
Residue:
410
  
Inhibitor
Name:
BDBM50369097
Synonyms:
CHEMBL604851
Type:
Small organic molecule
Emp. Form.:
C21H22N6O4
Mol. Mass.:
422.4372
SMILES:
CCNC(=O)[C@H]1OC([C@H](O)[C@@H]1O)n1cnc2c(N)nc(nc12)C#CCc1ccccc1
: