Target
Sigma non-opioid intracellular receptor 1
Ligand
BDBM81982
Substrate
Meas. Tech.
ChEMBL_201728 (CHEMBL803925)
Ki
37±n/a nM
Citation
 Berardi, FColabufo, NAGiudice, GPerrone, RTortorella, VGovoni, SLucchi, L New sigma and 5-HT1A receptor ligands: omega-(tetralin-1-yl)-n-alkylamine derivatives. J Med Chem 39:176-82 (1996)  
Target
Name:
Sigma non-opioid intracellular receptor 1
Synonyms:
Aging-associated gene 8 protein SGMR1_HUMAN SIGMAR1 SR31747-binding protein Sigma 1-type opioid receptor Sigma1R | hSigmaR1
Type:
Enzyme Catalytic Domain
Mol. Mass.:
25124.85
Organism:
Homo sapiens (Human)
Description:
Q99720
Residue:
223
  
Inhibitor
Name:
BDBM81982
Synonyms:
CAS_97-39-2 DTG Tol2Gdn | cid_7333
Type:
Small organic molecule
Emp. Form.:
C15H17N3
Mol. Mass.:
239.3156
SMILES:
Cc1ccccc1NC(N)=Nc1ccccc1C
: