Target
Adenosine receptor A3
Ligand
BDBM50052395
Substrate
Meas. Tech.
ChEMBL_31693 (CHEMBL645775)
Ki
62300±n/a nM
Citation
 van Rhee, AMJiang, JLMelman, NOlah, MEStiles, GLJacobson, KA Interaction of 1,4-dihydropyridine and pyridine derivatives with adenosine receptors: selectivity for A3 receptors. J Med Chem 39:2980-9 (1996)  
Target
Name:
Adenosine receptor A3
Synonyms:
A3 adenosine receptor (hA3) ADORA3 | Adenosine A3 receptor (A3AR)
Type:
G Protein-Coupled Receptor (GPCR)
Mol. Mass.:
36197.32
Organism:
Homo sapiens (Human)
Description:
P0DMS8
Residue:
318
  
Inhibitor
Name:
BDBM50052395
Synonyms:
2,4,6-Trimethyl-1,4-dihydro-pyridine-3,5-dicarboxylic acid 3-(2-methoxy-ethyl) ester 5-methyl ester | CHEMBL103643
Type:
Small organic molecule
Emp. Form.:
C14H21NO5
Mol. Mass.:
283.3202
SMILES:
COCCOC(=O)C1=C(C)N=C(C)C(C1C)C(=O)OC
: