Target
Adenosine receptor A2a
Ligand
BDBM50119168
Substrate
Meas. Tech.
ChEMBL_31064 (CHEMBL641348)
Ki
2.2±n/a nM
Citation
 Vittori, SCamaioni, EDi Francesco, EVolpini, RMonopoli, ADionisotti, SOngini, ECristalli, G 2-alkenyl and 2-alkyl derivatives of adenosine and adenosine-5'-N-ethyluronamide: different affinity and selectivity of E- and Z-diastereomers at A2A adenosine receptors. J Med Chem 39:4211-7 (1996)  
Target
Name:
Adenosine receptor A2a
Synonyms:
AA2AR_RAT Adenosine A2 receptor Adenosine Receptors A2a (A2a) Adenosine receptors A2a Rat striatal adenosine A2a receptor
Type:
G Protein-Coupled Receptor (GPCR)
Mol. Mass.:
45015.65
Organism:
Rattus norvegicus (rat)
Description:
Rat A2A receptors expressed in CHO cells.
Residue:
410
  
Inhibitor
Name:
BDBM50119168
Synonyms:
(2R,3R,4S,5R)-2-(6-Amino-2-hex-1-ynyl-purin-9-yl)-5-hydroxymethyl-tetrahydro-furan-3,4-diol (2R,3R,4S,5R)-2-(6-amino-2-(hex-1-ynyl)-9H-purin-9-yl)-5-(hydroxymethyl)tetrahydrofuran-3,4-diol CHEMBL319387
Type:
Small organic molecule
Emp. Form.:
C16H21N5O4
Mol. Mass.:
347.369
SMILES:
CCCCC#Cc1nc(N)c2ncn([C@@H]3O[C@H](CO)[C@@H](O)[C@H]3O)c2n1
: