Target
Sodium/potassium-transporting ATPase subunit alpha-1
Ligand
BDBM50408115
Substrate
Meas. Tech.
ChEMBL_54059 (CHEMBL669632)
IC50
660±n/a nM
Citation
 Templeton, JFLing, YMarat, KLaBella, FS Synthesis and structure-activity relationships of 17beta-substituted 14beta-hydroxysteroid 3-(alpha-L-rhamnopyranoside)s: steroids that bind to the digitalis receptor. J Med Chem 40:1439-46 (1997)  
Target
Name:
Sodium/potassium-transporting ATPase subunit alpha-1
Synonyms:
AT1A1_CANLF Sodium/potassium-transporting ATPase alpha-1 chain
Type:
PROTEIN
Mol. Mass.:
112656.60
Organism:
Canis familiaris
Description:
ChEMBL_144092
Residue:
1021
  
Inhibitor
Name:
BDBM50408115
Synonyms:
CHEMBL2069067
Type:
Small organic molecule
Emp. Form.:
C27H46O7
Mol. Mass.:
482.6499
SMILES:
C[C@@H]1O[C@@H](O[C@H]2CC[C@@]3(C)[C@H](CC[C@@H]4[C@@H]3CC[C@]3(C)[C@@H](CCO)CC[C@]43O)C2)[C@H](O)[C@H](O)[C@H]1O
: