Target
D(1) dopamine receptor
Ligand
BDBM50057840
Substrate
Meas. Tech.
ChEMBL_59005 (CHEMBL880003)
EC50
240±n/a nM
Citation
 Michaelides, MRHong, YDiDomenico, SBayburt, EKAsin, KEBritton, DRLin, CWShiosaki, K Substituted hexahydrobenzo[f]thieno[c]quinolines as dopamine D1-selective agonists: synthesis and biological evaluation in vitro and in vivo. J Med Chem 40:1585-99 (1997)  
Target
Name:
D(1) dopamine receptor
Synonyms:
D(1) dopamine receptor Dopamine D1 receptor
Type:
Mol. Mass.:
40664.04
Organism:
Carassius auratus
Description:
Residue:
363
  
Inhibitor
Name:
BDBM50057840
Synonyms:
(5aR,11bS)-4,5,5a,6,7,11b-Hexahydro-2-thia-5-aza-cyclopenta[c]phenanthrene-9,10-diol; hydrobromide | CHEMBL554571
Type:
Small organic molecule
Emp. Form.:
C15H15NO2S
Mol. Mass.:
273.35
SMILES:
Oc1cc2CC[C@H]3NCc4cscc4[C@@H]3c2cc1O
: