Target
D(1) dopamine receptor
Ligand
BDBM50004822
Substrate
Meas. Tech.
ChEMBL_59005 (CHEMBL880003)
EC50
950±n/a nM
Citation
 Michaelides, MRHong, YDiDomenico, SBayburt, EKAsin, KEBritton, DRLin, CWShiosaki, K Substituted hexahydrobenzo[f]thieno[c]quinolines as dopamine D1-selective agonists: synthesis and biological evaluation in vitro and in vivo. J Med Chem 40:1585-99 (1997)  
Target
Name:
D(1) dopamine receptor
Synonyms:
D(1) dopamine receptor Dopamine D1 receptor
Type:
Mol. Mass.:
40664.04
Organism:
Carassius auratus
Description:
Residue:
363
  
Inhibitor
Name:
BDBM50004822
Synonyms:
(R)-1-phenyl-2,3,4,5-tetrahydro-1H-benzo[d]azepine-7,8-diol 1-Phenyl-2,3,4,5-tetrahydro-1H-benzo[d]azepine-7,8-diol 7,8-Dihydroxy-1-phenyl-2,3,4,5-tetrahydro-1H-benzo[d]azepinium(R(+)SKF38393) CHEMBL24077 SK&F-383933 SK-383933 SKF 38393 (+)
Type:
Small organic molecule
Emp. Form.:
C16H17NO2
Mol. Mass.:
255.3117
SMILES:
Oc1cc2CCNC[C@H](c3ccccc3)c2cc1O
: