Target
D(1) dopamine receptor
Ligand
BDBM50057854
Substrate
Meas. Tech.
ChEMBL_59005 (CHEMBL880003)
EC50
470±n/a nM
Citation
 Michaelides, MRHong, YDiDomenico, SBayburt, EKAsin, KEBritton, DRLin, CWShiosaki, K Substituted hexahydrobenzo[f]thieno[c]quinolines as dopamine D1-selective agonists: synthesis and biological evaluation in vitro and in vivo. J Med Chem 40:1585-99 (1997)  
Target
Name:
D(1) dopamine receptor
Synonyms:
D(1) dopamine receptor Dopamine D1 receptor
Type:
Mol. Mass.:
40664.04
Organism:
Carassius auratus
Description:
Residue:
363
  
Inhibitor
Name:
BDBM50057854
Synonyms:
(5aS,11bR)-2-(3-Methyl-butyl)-4,5,5a,6,7,11b-hexahydro-3-thia-5-aza-cyclopenta[c]phenanthrene-9,10-diol | CHEMBL41809
Type:
Small organic molecule
Emp. Form.:
C20H25NO2S
Mol. Mass.:
343.483
SMILES:
CC(C)CCc1cc2[C@@H]3[C@H](CCc4cc(O)c(O)cc34)NCc2s1
: