Target
D(1) dopamine receptor
Ligand
BDBM50057858
Substrate
Meas. Tech.
ChEMBL_59005 (CHEMBL880003)
EC50
160±n/a nM
Citation
 Michaelides, MRHong, YDiDomenico, SBayburt, EKAsin, KEBritton, DRLin, CWShiosaki, K Substituted hexahydrobenzo[f]thieno[c]quinolines as dopamine D1-selective agonists: synthesis and biological evaluation in vitro and in vivo. J Med Chem 40:1585-99 (1997)  
Target
Name:
D(1) dopamine receptor
Synonyms:
D(1) dopamine receptor Dopamine D1 receptor
Type:
Mol. Mass.:
40664.04
Organism:
Carassius auratus
Description:
Residue:
363
  
Inhibitor
Name:
BDBM50057858
Synonyms:
(5aR,11bR)-3-Propyl-4,5,5a,6,7,11b-hexahydro-1-thia-5-aza-cyclopenta[c]phenanthrene-9,10-diol; hydrochloride | CHEMBL542351
Type:
Small organic molecule
Emp. Form.:
C18H21NO2S
Mol. Mass.:
315.43
SMILES:
CCCc1csc2[C@H]3[C@@H](CCc4cc(O)c(O)cc34)NCc12
: