Target
Protein farnesyltransferase subunit beta/geranylgeranyltransferase type-1 subunit alpha
Ligand
BDBM50059876
Substrate
Meas. Tech.
ChEMBL_70573 (CHEMBL682706)
IC50
10±n/a nM
Citation
 Leonard, DMShuler, KRPoulter, CJEaton, SRSawyer, TKHodges, JCSu, TZScholten, JDGowan, RCSebolt-Leopold, JSDoherty, AM Structure-activity relationships of cysteine-lacking pentapeptide derivatives that inhibit ras farnesyltransferase. J Med Chem 40:192-200 (1997)  
Target
Name:
Protein farnesyltransferase subunit beta/geranylgeranyltransferase type-1 subunit alpha
Synonyms:
Farnesyltransferase (FTase) Protein Farnesyltransferase (PFT) Chain B | Protein farnesyltransferase
Type:
Protein Complex
Mol. Mass.:
Description:
To express recombinant enzyme in E. coli, the cloned human alpha and beta subunits were co-expressed from a plasmid, in which their expression was translationally coupled.
Components:
This complex has 2 components.
Component 1
Name:
Protein farnesyltransferase subunit beta
Synonyms:
CAAX farnesyltransferase subunit alpha FNTB FTase-alpha GGTase-I-alpha Protein farnesyl/geranylgeranyl transferase Protein farnesyltransferase subunit beta Protein farnesyltransferase/geranylgeranyltransferase type-1 subunit alpha Ras proteins prenyltransferase subunit beta | Type I protein geranyl-geranyltransferase subunit alpha
Type:
Enzyme Subunit
Mol. Mass.:
48766.02
Organism:
Homo sapiens (Human)
Description:
Protein farnesyltransferase subunit beta
Residue:
437
  
Component 2
Name:
Protein farnesyltransferase/geranylgeranyltransferase type-1 subunit alpha
Synonyms:
CAAX farnesyltransferase alpha subunit FNTA_HUMAN FTase-alpha Geranylgeranyl Transferase (GGTase-I) Chain A Protein Farnesyltransferase (PFT) Chain A Protein farnesyltransferase Protein farnesyltransferase/geranylgeranyltransferase type I alpha subunit | Ras proteins prenyltransferase alpha
Type:
Enzyme
Mol. Mass.:
44392.46
Organism:
Homo sapiens (Human)
Description:
Recombinant human FTase.
Residue:
379
  
Inhibitor
Name:
BDBM50059876
Synonyms:
CHEMBL217423 [(S)-1-[(S)-1-{(S)-2-Benzyloxy-1-[(S)-1-((R)-1-carbamoyl-ethylcarbamoyl)-2-(1H-indol-3-yl)-ethylcarbamoyl]-ethylcarbamoyl}-2-(4-benzyloxy-phenyl)-ethylcarbamoyl]-2-(3H-imidazol-4-yl)-ethyl]-carbamic acid benzyl ester
Type:
Small organic molecule
Emp. Form.:
C54H57N9O9
Mol. Mass.:
976.0853
SMILES:
C[C@@H](NC(=O)[C@H](Cc1c[nH]c2ccccc12)NC(=O)[C@H](COCc1ccccc1)NC(=O)[C@H](Cc1ccc(OCc2ccccc2)cc1)NC(=O)[C@H](Cc1cnc[nH]1)NC(=O)OCc1ccccc1)C(N)=O
: