Target
D(2) dopamine receptor
Ligand
BDBM50060602
Substrate
Meas. Tech.
ChEMBL_59624 (CHEMBL670960)
Ki
50±n/a nM
Citation
 Baures, PWOjala, WHCostain, WJOtt, MCPradhan, AGleason, WBMishra, RKJohnson, RL Design, synthesis, and dopamine receptor modulating activity of diketopiperazine peptidomimetics of L-prolyl-L-leucylglycinamide. J Med Chem 40:3594-600 (1997)  
Target
Name:
D(2) dopamine receptor
Synonyms:
DOPAMINE D2 DRD2_BOVIN | Dopamine D2 receptor
Type:
Enzyme Catalytic Domain
Mol. Mass.:
50698.79
Organism:
BOVINE
Description:
P20288
Residue:
444
  
Inhibitor
Name:
BDBM50060602
Synonyms:
2-[3-((2R,8aS)-1,4-Dioxo-hexahydro-pyrrolo[1,2-a]pyrazin-2-yl)-2-oxo-pyrrolidin-1-yl]-acetamide
Type:
Small organic molecule
Emp. Form.:
C13H18N4O4
Mol. Mass.:
294.3064
SMILES:
NC(=O)CN1CCC(N2CC(=O)N3CCC[C@H]3C2=O)C1=O
: