Target
Glutamate receptor 1
Ligand
BDBM17657
Substrate
Meas. Tech.
ChEMBL_90141 (CHEMBL878883)
Ki
1360±n/a nM
Citation
 Jane, DEHoo, KKamboj, RDeverill, MBleakman, DMandelzys, A Synthesis of willardiine and 6-azawillardiine analogs: pharmacological characterization on cloned homomeric human AMPA and kainate receptor subtypes. J Med Chem 40:3645-50 (1997)  
Target
Name:
Glutamate receptor 1
Synonyms:
AMPA-selective glutamate receptor 1 GLUR1 GRIA1_HUMAN GluR-A Glutamate AMPA 1 Glutamate receptor AMPA 1/2 Glutamate receptor ionotropic, AMPA 1
Type:
Enzyme Catalytic Domain
Mol. Mass.:
101512.92
Organism:
Homo sapiens (Human)
Description:
Glutamate AMPA 1 GRIA1 HUMAN::P42261
Residue:
906
  
Inhibitor
Name:
BDBM17657
Synonyms:
(2S)-2-aminopentanedioic acid D-Glutamate L-Glu L-Glutamic acid L-gluatmate
Type:
Amino Acid
Emp. Form.:
C5H9NO4
Mol. Mass.:
147.1293
SMILES:
N[C@@H](CCC(O)=O)C(O)=O
: