Target
Integrase
Ligand
BDBM50056935
Substrate
Meas. Tech.
ChEMBL_90895 (CHEMBL699508)
IC50
55400±n/a nM
Citation
 Neamati, NHong, HMazumder, AWang, SSunder, SNicklaus, MCMilne, GWProksa, BPommier, Y Depsides and depsidones as inhibitors of HIV-1 integrase: discovery of novel inhibitors through 3D database searching. J Med Chem 40:942-51 (1997)  
Target
Name:
Integrase
Synonyms:
Human immunodeficiency virus type 1 integrase
Type:
PROTEIN
Mol. Mass.:
32231.48
Organism:
Human immunodeficiency virus 1
Description:
ChEMBL_90865
Residue:
288
  
Inhibitor
Name:
BDBM50056935
Synonyms:
3-(3,4-Dihydroxy-phenyl)-2-(4-nitro-benzoylamino)-propionic acid benzyl ester NSC-132526
Type:
Small organic molecule
Emp. Form.:
C23H20N2O7
Mol. Mass.:
436.4141
SMILES:
Oc1ccc(CC(NC(=O)c2ccc(cc2)[N+]([O-])=O)C(=O)OCc2ccccc2)cc1O
: