Target
Histamine H1 receptor
Ligand
BDBM50056944
Substrate
Meas. Tech.
ChEMBL_84717 (CHEMBL695165)
Ki
58±n/a nM
Citation
 el Ahmad, YLaurent, EMaillet, PTalab, ATeste, JFDokhan, RTran, GOllivier, R New benzocycloalkylpiperazines, potent and selective 5-HT1A receptor ligands. J Med Chem 40:952-60 (1997)  
Target
Name:
Histamine H1 receptor
Synonyms:
HISTAMINE H1 Hrh1
Type:
Enzyme Catalytic Domain
Mol. Mass.:
55716.35
Organism:
RAT
Description:
HISTAMINE H1 HRH1 RAT::P31390
Residue:
486
  
Inhibitor
Name:
BDBM50056944
Synonyms:
4-Fluoro-N-{2-[4-(1,2,3,4-tetrahydro-naphthalen-1-yl)-piperazin-1-yl]-ethyl}-benzamide | CHEMBL368061
Type:
Small organic molecule
Emp. Form.:
C23H28FN3O
Mol. Mass.:
381.4863
SMILES:
Fc1ccc(cc1)C(=O)NCCN1CCN(CC1)C1CCCc2ccccc12
: