Target
5-hydroxytryptamine receptor 2C
Ligand
BDBM31005
Substrate
Meas. Tech.
ChEMBL_1846 (CHEMBL616817)
Ki
3.8±n/a nM
Citation
 el Ahmad, YLaurent, EMaillet, PTalab, ATeste, JFDokhan, RTran, GOllivier, R New benzocycloalkylpiperazines, potent and selective 5-HT1A receptor ligands. J Med Chem 40:952-60 (1997)  
Target
Name:
5-hydroxytryptamine receptor 2C
Synonyms:
5-HT-1C 5-HT1C 5-HT2C-INI 5-HTR2C 5-hydroxytryptamine receptor 2C (5-HT-2C) 5HT-1C HTR1C Serotonin (5-HT3) receptor Serotonin Receptor 2C
Type:
G Protein-Coupled Receptor (GPCR)
Mol. Mass.:
51836.79
Organism:
Homo sapiens (Human)
Description:
P28335
Residue:
458
  
Inhibitor
Name:
BDBM31005
Synonyms:
2-methyl-1,2,3,4,10,14b-hexahydrodibenzo[c,f]pyrazino[1,2-a]azepine MLS000069681 cid_68551
Type:
Small organic molecule
Emp. Form.:
C18H21ClN2
Mol. Mass.:
300.826
SMILES:
Cl.CN1CCN2C(C1)c1ccccc1Cc1ccccc21
: