Target
D(2) dopamine receptor
Ligand
BDBM50056945
Substrate
Meas. Tech.
ChEMBL_59490 (CHEMBL670142)
Ki
480±n/a nM
Citation
 el Ahmad, YLaurent, EMaillet, PTalab, ATeste, JFDokhan, RTran, GOllivier, R New benzocycloalkylpiperazines, potent and selective 5-HT1A receptor ligands. J Med Chem 40:952-60 (1997)  
Target
Name:
D(2) dopamine receptor
Synonyms:
DOPAMINE D2 DRD2_BOVIN | Dopamine D2 receptor
Type:
Enzyme Catalytic Domain
Mol. Mass.:
50698.79
Organism:
BOVINE
Description:
P20288
Residue:
444
  
Inhibitor
Name:
BDBM50056945
Synonyms:
4-Chloro-N-{2-[4-(1,2,3,4-tetrahydro-naphthalen-1-yl)-piperazin-1-yl]-ethyl}-benzamide | CHEMBL177031
Type:
Small organic molecule
Emp. Form.:
C23H28ClN3O
Mol. Mass.:
397.941
SMILES:
Clc1ccc(cc1)C(=O)NCCN1CCN(CC1)C1CCCc2ccccc12
: