Target
3-oxo-5-alpha-steroid 4-dehydrogenase 1
Ligand
BDBM50057476
Substrate
Meas. Tech.
ChEMBL_205217 (CHEMBL816491)
IC50
350±n/a nM
Citation
 Kenny, BBallard, SBlagg, JFox, D Pharmacological options in the treatment of benign prostatic hyperplasia. J Med Chem 40:1293-315 (1997)  
Target
Name:
3-oxo-5-alpha-steroid 4-dehydrogenase 1
Synonyms:
3-oxo-5-alpha-steroid 4-dehydrogenase 1 S5A1_HUMAN SR type 1 Steroid 5-alpha-reductase | Steroid 5-alpha-reductase 1
Type:
Enzyme
Mol. Mass.:
29472.80
Organism:
Homo sapiens (Human)
Description:
P18405
Residue:
259
  
Inhibitor
Name:
BDBM50057476
Synonyms:
(4aR,6aS,7S)-4a,6a-Dimethyl-2-oxo-2,4a,4b,5,6,6a,7,8,9,9a,9b,10,11,11a-tetradecahydro-1H-indeno[5,4-f]quinoline-7-carboxylic acid methyl-phenyl-amide | CHEMBL25072
Type:
Small organic molecule
Emp. Form.:
C26H34N2O2
Mol. Mass.:
406.5604
SMILES:
CN(C(=O)[C@H]1CCC2C3CCC4NC(=O)C=C[C@]4(C)C3CC[C@]12C)c1ccccc1
: