Target
3-oxo-5-alpha-steroid 4-dehydrogenase 1
Ligand
BDBM50031897
Substrate
Meas. Tech.
ChEMBL_205219 (CHEMBL816493)
Ki
0.60±n/a nM
Citation
 Kenny, BBallard, SBlagg, JFox, D Pharmacological options in the treatment of benign prostatic hyperplasia. J Med Chem 40:1293-315 (1997)  
Target
Name:
3-oxo-5-alpha-steroid 4-dehydrogenase 1
Synonyms:
3-oxo-5-alpha-steroid 4-dehydrogenase 1 S5A1_HUMAN SR type 1 Steroid 5-alpha-reductase | Steroid 5-alpha-reductase 1
Type:
Enzyme
Mol. Mass.:
29472.80
Organism:
Homo sapiens (Human)
Description:
P18405
Residue:
259
  
Inhibitor
Name:
BDBM50031897
Synonyms:
(1S,9aR,11aS)-6-Chloro-9a,11a-dimethyl-7-oxo-2,3,3a,3b,4,5,7,8,9,9a,9b,10,11,11a-tetradecahydro-1H-cyclopenta[i]phenanthridine-1-carboxylic acid (4-chloro-phenyl)-cyclopentyl-amide | CHEMBL283430
Type:
Small organic molecule
Emp. Form.:
C30H38Cl2N2O2
Mol. Mass.:
529.541
SMILES:
C[C@]12CCC3C(CN=C4C(Cl)C(=O)CC[C@]34C)C1CC[C@@H]2C(=O)N(C1CCCC1)c1ccc(Cl)cc1
: