Target
3-oxo-5-alpha-steroid 4-dehydrogenase 1
Ligand
BDBM50031889
Substrate
Meas. Tech.
ChEMBL_205219 (CHEMBL816493)
Ki
0.30±n/a nM
Citation
 Kenny, BBallard, SBlagg, JFox, D Pharmacological options in the treatment of benign prostatic hyperplasia. J Med Chem 40:1293-315 (1997)  
Target
Name:
3-oxo-5-alpha-steroid 4-dehydrogenase 1
Synonyms:
3-oxo-5-alpha-steroid 4-dehydrogenase 1 S5A1_HUMAN SR type 1 Steroid 5-alpha-reductase | Steroid 5-alpha-reductase 1
Type:
Enzyme
Mol. Mass.:
29472.80
Organism:
Homo sapiens (Human)
Description:
P18405
Residue:
259
  
Inhibitor
Name:
BDBM50031889
Synonyms:
(1S,9aR,11aS)-6,9a,11a-Trimethyl-7-oxo-2,3,3a,3b,4,5,7,8,9,9a,9b,10,11,11a-tetradecahydro-1H-cyclopenta[i]phenanthridine-1-carboxylic acid (4-chloro-phenyl)-cyclopentyl-amide | CHEMBL283123
Type:
Small organic molecule
Emp. Form.:
C31H41ClN2O2
Mol. Mass.:
509.122
SMILES:
CC1C(=O)CC[C@]2(C)C3CC[C@@]4(C)C(CC[C@@H]4C(=O)N(C4CCCC4)c4ccc(Cl)cc4)C3CN=C12
: