Target
Delta-type opioid receptor
Ligand
BDBM50001683
Substrate
Meas. Tech.
ChEMBL_145498 (CHEMBL752140)
Ki
2.2±n/a nM
Citation
 Shreder, KZhang, LDang, TYaksh, TLUmeno, HDeHaven, RDaubert, JGoodman, M Synthesis and biological activity of a novel methylamine-bridged enkephalin analogue (MABE): a new route to cyclic peptides and peptidomimetics. J Med Chem 41:2631-5 (1998)  
Target
Name:
Delta-type opioid receptor
Synonyms:
D-OR-1 Delta opioid receptor OPIATE Delta OPRD1 OPRK1 | opioid receptor, delta 1
Type:
G Protein-Coupled Receptor (GPCR)
Mol. Mass.:
40382.98
Organism:
Homo sapiens (Human)
Description:
Competition binding assays were carried out using membrane preparations from transfected HN9.10 cells that constitutively expressed the delta opioid receptor.
Residue:
372
  
Inhibitor
Name:
BDBM50001683
Synonyms:
13-[2-Amino-3-(4-hydroxy-phenyl)-propionylamino]-7-benzyl-3,3,14,14-tetramethyl-6,9,12-trioxo-1,2-dithia-5,8,11-triaza-cyclotetradecane-4-carboxylic acid CHEMBL294616 | DPDPE
Type:
Small organic molecule
Emp. Form.:
C30H39N5O7S2
Mol. Mass.:
645.79
SMILES:
CC1(C)SSC(C)(C)[C@@H](NC(=O)[C@@H](N)Cc2ccc(O)cc2)C(=O)NCC(=O)N[C@H](Cc2ccccc2)C(=O)N[C@H]1C(O)=O
: