Target
Mu-type opioid receptor
Ligand
BDBM21864
Substrate
Meas. Tech.
ChEMBL_148852 (CHEMBL756648)
Ki
50±n/a nM
Citation
 Ananthan, SJohnson, CACarter, RLClayton, SDRice, KCXu, HDavis, PPorreca, FRothman, RB Synthesis, opioid receptor binding, and bioassay of naltrindole analogues substituted in the indolic benzene moiety. J Med Chem 41:2872-81 (1998)  
Target
Name:
Mu-type opioid receptor
Synonyms:
MOR-1 Mu-type opioid receptor (MOR) OPRM_RAT Opioid receptor B Ror-b
Type:
G Protein-Coupled Receptor (GPCR)
Mol. Mass.:
44503.11
Organism:
Rattus norvegicus (rat)
Description:
Competition binding assays were carried out using membrane preparations from transfected HN9.10 cells that constitutively expressed the mu opioid receptor.
Residue:
398
  
Inhibitor
Name:
BDBM21864
Synonyms:
(21R)-22-(cyclopropylmethyl)-14-oxa-11,22-diazaheptacyclo[13.9.1.0^{1,13}.0^{2,21}.0^{4,12}.0^{5,10}.0^{19,25}]pentacosa-4(12),5,7,9,15,17,19(25)-heptaene-2,16-diol NALTRINDOLE | [3H]-naltrindole
Type:
radiolabeled ligand
Emp. Form.:
C26H26N2O3
Mol. Mass.:
414.4962
SMILES:
[H][C@@]12Cc3ccc(O)c4OC5c6[nH]c7ccccc7c6CC1(O)C5(CCN2CC1CC1)c34
: