Target
Delta-type opioid receptor
Ligand
BDBM50065851
Substrate
Meas. Tech.
ChEMBL_146913 (CHEMBL757501)
Ki
68±n/a nM
Citation
 Ananthan, SJohnson, CACarter, RLClayton, SDRice, KCXu, HDavis, PPorreca, FRothman, RB Synthesis, opioid receptor binding, and bioassay of naltrindole analogues substituted in the indolic benzene moiety. J Med Chem 41:2872-81 (1998)  
Target
Name:
Delta-type opioid receptor
Synonyms:
Cytochrome P450 3A4 Delta opioid receptor Delta-type opioid receptor (DOR) OPRD_RAT Opioid receptor Opioid receptors; mu & delta Ror-a | Voltage-gated potassium channel
Type:
G Protein-Coupled Receptor (GPCR)
Mol. Mass.:
40465.04
Organism:
Rattus norvegicus (rat)
Description:
Competition binding assays were using CHO-K1 cell membranes expressing the opioid receptor.
Residue:
372
  
Inhibitor
Name:
BDBM50065851
Synonyms:
22-cyclopropylmethyl-6-phenoxy-14-oxa-11,22-diazaheptacyclo[13.9.1.01,13.02,21.04,12.05,10.019,25]pentacosa-4(12),5(10),6,8,15(25),16,18-heptaene-2,16-diol | CHEMBL318858
Type:
Small organic molecule
Emp. Form.:
C32H30N2O4
Mol. Mass.:
506.5916
SMILES:
Oc1ccc2C[C@H]3N(CC4CC4)CC[C@@]45C(Oc1c24)c1[nH]c2cccc(Oc4ccccc4)c2c1C[C@@]35O
: