Target
Kappa-type opioid receptor
Ligand
BDBM50065863
Substrate
Meas. Tech.
ChEMBL_146097 (CHEMBL753325)
Ki
21±n/a nM
Citation
 Ananthan, SJohnson, CACarter, RLClayton, SDRice, KCXu, HDavis, PPorreca, FRothman, RB Synthesis, opioid receptor binding, and bioassay of naltrindole analogues substituted in the indolic benzene moiety. J Med Chem 41:2872-81 (1998)  
Target
Name:
Kappa-type opioid receptor
Synonyms:
Kappa Opioid Receptor OPRK1 Opiate Kappa 1 | mu/kappa opioid receptor
Type:
G Protein-Coupled Receptor (GPCR)
Mol. Mass.:
42744.99
Organism:
Cavia porcellus (domestic guinea pig)
Description:
P41144
Residue:
380
  
Inhibitor
Name:
BDBM50065863
Synonyms:
22-cyclopropylmethyl-7-[2-(2-pyridyl)-(E)-1-ethenyl]-14-oxa-11,22-diazaheptacyclo[13.9.1.01,13.02,21.04,12.05,10.019,25]pentacosa-4(12),5(10),6,8,15(25),16,18-heptaene-2,16-diol | CHEMBL95596
Type:
Small organic molecule
Emp. Form.:
C33H31N3O3
Mol. Mass.:
517.6175
SMILES:
Oc1ccc2C[C@H]3N(CC4CC4)CC[C@@]45C(Oc1c24)c1[nH]c2ccc(\C=C\c4ccccn4)cc2c1C[C@@]35O
: