Target
B2 bradykinin receptor
Ligand
BDBM50067279
Substrate
Meas. Tech.
ChEMBL_40286 (CHEMBL653418)
IC50
5.2±n/a nM
Citation
 Abe, YKayakiri, HSatoh, SInoue, TSawada, YInamura, NAsano, MAramori, IHatori, CSawai, HOku, TTanaka, H A novel class of orally active non-peptide bradykinin B2 receptor antagonists. 3. Discovering bioisosteres of the imidazo[1,2-a] pyridine moiety. J Med Chem 41:4062-79 (1998)  
Target
Name:
B2 bradykinin receptor
Synonyms:
B2 BRADYKININ B2R BK-2 receptor BKRB2_HUMAN | Bradykinin B2 receptor
Type:
Enzyme Catalytic Domain
Mol. Mass.:
44467.17
Organism:
Homo sapiens (Human)
Description:
B2 BRADYKININ BDKRB2 HUMAN::P30411
Residue:
391
  
Inhibitor
Name:
BDBM50067279
Synonyms:
4-{(E)-2-[({[2,4-Dichloro-3-(3-methyl-quinoxalin-5-yloxymethyl)-phenyl]-methyl-carbamoyl}-methyl)-carbamoyl]-vinyl}-N-methyl-benzamide; hydrochloride | CHEMBL554206
Type:
Small organic molecule
Emp. Form.:
C30H27Cl2N5O4
Mol. Mass.:
592.472
SMILES:
CNC(=O)c1ccc(\C=C\C(=O)NCC(=O)N(C)c2ccc(Cl)c(COc3cccc4ncc(C)nc34)c2Cl)cc1
: