Target
B2 bradykinin receptor
Ligand
BDBM50067921
Substrate
Meas. Tech.
ChEMBL_40274 (CHEMBL656509)
IC50
2.3±n/a nM
Citation
 Abe, YKayakiri, HSatoh, SInoue, TSawada, YInamura, NAsano, MAramori, IHatori, CSawai, HOku, TTanaka, H A novel class of orally active non-peptide bradykinin B2 receptor antagonists. 4. Discovery of novel frameworks mimicking the active conformation. J Med Chem 41:4587-98 (1998)  
Target
Name:
B2 bradykinin receptor
Synonyms:
B2 bradykinin receptor BDKRB2 BKRB2_CAVPO | Bradykinin B2 receptor
Type:
Mol. Mass.:
42217.03
Organism:
Cavia porcellus
Description:
Residue:
372
  
Inhibitor
Name:
BDBM50067921
Synonyms:
4-((E)-2-{[2',4'-Dimethyl-3'-(2-methyl-quinolin-8-yloxymethyl)-biphenyl-2-ylmethyl]-carbamoyl}-vinyl)-N-methyl-benzamide | CHEMBL140383
Type:
Small organic molecule
Emp. Form.:
C37H35N3O3
Mol. Mass.:
569.6921
SMILES:
CNC(=O)c1ccc(\C=C\C(=O)NCc2ccccc2-c2ccc(C)c(COc3cccc4ccc(C)nc34)c2C)cc1
: